Reaction Details
TargetDelta-type opioid receptor
LigandBDBM50142697
Substrate/Competitorn/a
Meas. Tech.ChEMBL_1552652 (CHEMBL3762591)
Ki 12±n/a nM
Citation Turnaturi, RAricò, GRonsisvalle, GParenti, CPasquinucci, L Multitarget opioid ligands in pain relief: New players in an old game. Eur J Med Chem108:211-28 (2016) 
 
Delta-type opioid receptor
Name:Delta-type opioid receptor
Type:G Protein-Coupled Receptor (GPCR)
Mol. Mass.:40465.04
Organism:Rattus norvegicus (rat)
Description:Competition binding assays were using CHO-K1 cell membranes expressing the opioid receptor.
Residue:372
BDBM50142697
NameBDBM50142697
Synonyms:CHEMBL3759294
TypeSmall organic molecule
Emp. Form.C34H42N6O6S2
Mol. Mass.694.864
SMILESCCCC[C@@H]1NC(=O)[C@H](Cc2cccc3ccccc23)NC(=O)[C@H](CSSC[C@@H](NC1=O)C(N)=O)NC(=O)[C@@H](N)Cc1ccc(O)cc1