Reaction Details
TargetKappa-type opioid receptor
LigandBDBM50142696
Substrate/Competitorn/a
Meas. Tech.ChEMBL_1552645 (CHEMBL3762584)
Ki 1.3±n/a nM
Citation Turnaturi, RAricò, GRonsisvalle, GParenti, CPasquinucci, L Multitarget opioid ligands in pain relief: New players in an old game. Eur J Med Chem108:211-28 (2016) 
 
Kappa-type opioid receptor
Name:Kappa-type opioid receptor
Type:G Protein-Coupled Receptor (GPCR)
Mol. Mass.:42648.76
Organism:Homo sapiens (Human)
Description:P41145
Residue:380
BDBM50142696
NameBDBM50142696
Synonyms:CHEMBL3758259
TypeSmall organic molecule
Emp. Form.C38H42N6O6S2
Mol. Mass.742.907
SMILESN[C@@H](Cc1ccc(O)cc1)C(=O)N[C@H]1CSCSC[C@@H](NC(=O)[C@H](Cc2ccc3ccccc3c2)NC(=O)[C@H](Cc2ccccc2)NC1=O)C(N)=O