Reaction Details
TargetTrypanothione reductase
LigandBDBM50142684
Substrate/Competitorn/a
Meas. Tech.ChEMBL_1552581 (CHEMBL3762226)
IC50 9300±n/a nM
Citation Marcu, ASchurigt, UMüller, KMoll, HKrauth-Siegel, RLPrinz, H Inhibitory effect of phenothiazine- and phenoxazine-derived chloroacetamides on Leishmania major growth and Trypanosoma brucei trypanothione reductase. Eur J Med Chem108:436-43 (2016) 
 
Trypanothione reductase
Name:Trypanothione reductase
Type:Homodimer; oxidoreductase
Mol. Mass.:53285.53
Organism:Trypanosoma brucei brucei
Description:n/a
Residue:492
BDBM50142684
NameBDBM50142684
Synonyms:CHEMBL1651446
TypeSmall organic molecule
Emp. Form.C14H10ClNOS
Mol. Mass.275.753
SMILESClCC(=O)N1c2ccccc2Sc2ccccc12