Reaction Details
TargetTrypanothione reductase
LigandBDBM50399189
Substrate/Competitorn/a
Meas. Tech.ChEMBL_1552581 (CHEMBL3762226)
IC50>100000±n/a nM
Citation Marcu, ASchurigt, UMüller, KMoll, HKrauth-Siegel, RLPrinz, H Inhibitory effect of phenothiazine- and phenoxazine-derived chloroacetamides on Leishmania major growth and Trypanosoma brucei trypanothione reductase. Eur J Med Chem108:436-43 (2016) 
 
Trypanothione reductase
Name:Trypanothione reductase
Type:Homodimer; oxidoreductase
Mol. Mass.:53285.53
Organism:Trypanosoma brucei brucei
Description:n/a
Residue:492
BDBM50399189
NameBDBM50399189
Synonyms:CHEMBL2180182
TypeSmall organic molecule
Emp. Form.C14H11NO2
Mol. Mass.225.2426
SMILESCC(=O)N1c2ccccc2Oc2ccccc12