Reaction Details
TargetCarbonic anhydrase 9
LigandBDBM50366102
Substrate/Competitorn/a
Meas. Tech.ChEMBL_1552966 (CHEMBL3760250)
Ki 930±n/a nM
Citation Ferraroni, MCarta, FScozzafava, ASupuran, CT Thioxocoumarins Show an Alternative Carbonic Anhydrase Inhibition Mechanism Compared to Coumarins. J Med Chem59:462-73 (2016) 
 
Carbonic anhydrase 9
Name:Carbonic anhydrase 9
Type:Enzyme
Mol. Mass.:49669.03
Organism:Homo sapiens (Human)
Description:Catalytic domain of human cloned isozyme was used in the assay
Residue:459
BDBM50366102
NameBDBM50366102
Synonyms:CHEMBL1957172
TypeSmall organic molecule
Emp. Form.C12H10O3
Mol. Mass.202.206
SMILESC=CCOc1ccc2oc(=O)ccc2c1