Reaction Details
TargetCarbonic anhydrase 12
LigandBDBM50366096
Substrate/Competitorn/a
Meas. Tech.ChEMBL_1552967 (CHEMBL3760251)
Ki 280±n/a nM
Citation Ferraroni, MCarta, FScozzafava, ASupuran, CT Thioxocoumarins Show an Alternative Carbonic Anhydrase Inhibition Mechanism Compared to Coumarins. J Med Chem59:462-73 (2016) 
 
Carbonic anhydrase 12
Name:Carbonic anhydrase 12
Type:Enzyme
Mol. Mass.:39456.00
Organism:Homo sapiens (Human)
Description:Catalytic domain of human cloned isozyme was used in the assay
Residue:354
BDBM50366096
NameBDBM50366096
Synonyms:CHEMBL1957175
TypeSmall organic molecule
Emp. Form.C15H20O3Si
Mol. Mass.276.403
SMILESCC(C)(C)[Si](C)(C)Oc1ccc2oc(=O)ccc2c1