Reaction Details
TargetCarbonic anhydrase 1
LigandBDBM50366096
Substrate/Competitorn/a
Meas. Tech.ChEMBL_1552964 (CHEMBL3760248)
Ki 8780±n/a nM
Citation Ferraroni, MCarta, FScozzafava, ASupuran, CT Thioxocoumarins Show an Alternative Carbonic Anhydrase Inhibition Mechanism Compared to Coumarins. J Med Chem59:462-73 (2016) 
 
Carbonic anhydrase 1
Name:Carbonic anhydrase 1
Type:Enzyme
Mol. Mass.:28873.37
Organism:Homo sapiens (Human)
Description:P00915
Residue:261
BDBM50366096
NameBDBM50366096
Synonyms:CHEMBL1957175
TypeSmall organic molecule
Emp. Form.C15H20O3Si
Mol. Mass.276.403
SMILESCC(C)(C)[Si](C)(C)Oc1ccc2oc(=O)ccc2c1