Reaction Details
TargetCarbonic anhydrase 2
LigandBDBM50366096
Substrate/Competitorn/a
Meas. Tech.ChEMBL_1552965 (CHEMBL3760249)
Ki>100000±n/a nM
Citation Ferraroni, MCarta, FScozzafava, ASupuran, CT Thioxocoumarins Show an Alternative Carbonic Anhydrase Inhibition Mechanism Compared to Coumarins. J Med Chem59:462-73 (2016) 
 
Carbonic anhydrase 2
Name:Carbonic anhydrase 2
Type:Enzyme
Mol. Mass.:29250.71
Organism:Homo sapiens (Human)
Description:P00918
Residue:260
BDBM50366096
NameBDBM50366096
Synonyms:CHEMBL1957175
TypeSmall organic molecule
Emp. Form.C15H20O3Si
Mol. Mass.276.403
SMILESCC(C)(C)[Si](C)(C)Oc1ccc2oc(=O)ccc2c1