Reaction Details
TargetHistone deacetylase 1
LigandBDBM50143886
Substrate/Competitorn/a
Meas. Tech.ChEMBL_1551210 (CHEMBL3761791)
IC50 2.3±n/a nM
Citation Ghosh, BZhao, WNReis, SAPatnaik, DFass, DMTsai, LHMazitschek, RHaggarty, SJ Dissecting structure-activity-relationships of crebinostat: Brain penetrant HDAC inhibitors for neuroepigenetic regulation. Bioorg Med Chem Lett26:1265-71 (2016) 
 
Histone deacetylase 1
Name:Histone deacetylase 1
Type:Enzyme
Mol. Mass.:55090.27
Organism:Homo sapiens (Human)
Description:Q13547
Residue:482
BDBM50143886
NameBDBM50143886
Synonyms:CHEMBL3758870
TypeSmall organic molecule
Emp. Form.C19H22N4O3
Mol. Mass.354.403
SMILESONC(=O)CCCCCC(=O)N\N=C\c1ccc(cc1)-c1ccccn1