Reaction Details
TargetHistone deacetylase 2
LigandBDBM50143887
Substrate/Competitorn/a
Meas. Tech.ChEMBL_1551211 (CHEMBL3761792)
IC50 11±n/a nM
Citation Ghosh, BZhao, WNReis, SAPatnaik, DFass, DMTsai, LHMazitschek, RHaggarty, SJ Dissecting structure-activity-relationships of crebinostat: Brain penetrant HDAC inhibitors for neuroepigenetic regulation. Bioorg Med Chem Lett26:1265-71 (2016) 
 
Histone deacetylase 2
Name:Histone deacetylase 2
Type:Chromatin regulator; hydrolase; repressor
Mol. Mass.:55356.54
Organism:Homo sapiens (Human)
Description:Q92769
Residue:488
BDBM50143887
NameBDBM50143887
Synonyms:CHEMBL3759794
TypeSmall organic molecule
Emp. Form.C19H22N4O3
Mol. Mass.354.403
SMILESONC(=O)CCCCCC(=O)N\N=C\c1ccc(cc1)-c1cccnc1