Reaction Details
TargetHistone deacetylase 3
LigandBDBM50143885
Substrate/Competitorn/a
Meas. Tech.ChEMBL_1551212 (CHEMBL3761793)
IC50 5.4±n/a nM
Citation Ghosh, BZhao, WNReis, SAPatnaik, DFass, DMTsai, LHMazitschek, RHaggarty, SJ Dissecting structure-activity-relationships of crebinostat: Brain penetrant HDAC inhibitors for neuroepigenetic regulation. Bioorg Med Chem Lett26:1265-71 (2016) 
 
Histone deacetylase 3
Name:Histone deacetylase 3
Type:Enzyme
Mol. Mass.:48829.55
Organism:Homo sapiens (Human)
Description:O15379
Residue:428
BDBM50143885
NameBDBM50143885
Synonyms:CHEMBL3758191
TypeSmall organic molecule
Emp. Form.C21H25N3O3
Mol. Mass.367.4415
SMILESCc1ccccc1-c1ccc(\C=N\NC(=O)CCCCCC(=O)NO)cc1