Reaction Details
TargetHistone deacetylase 6
LigandBDBM50143887
Substrate/Competitorn/a
Meas. Tech.ChEMBL_1551371 (CHEMBL3762492)
IC50 0.500000±n/a nM
Citation Ghosh, BZhao, WNReis, SAPatnaik, DFass, DMTsai, LHMazitschek, RHaggarty, SJ Dissecting structure-activity-relationships of crebinostat: Brain penetrant HDAC inhibitors for neuroepigenetic regulation. Bioorg Med Chem Lett26:1265-71 (2016) 
 
Histone deacetylase 6
Name:Histone deacetylase 6
Type:Chromatin regulator; hydrolase; repressor
Mol. Mass.:131381.51
Organism:Homo sapiens (Human)
Description:Q9UBN7
Residue:1215
BDBM50143887
NameBDBM50143887
Synonyms:CHEMBL3759794
TypeSmall organic molecule
Emp. Form.C19H22N4O3
Mol. Mass.354.403
SMILESONC(=O)CCCCCC(=O)N\N=C\c1ccc(cc1)-c1cccnc1