Reaction Details
TargetCarbonic anhydrase 9
LigandBDBM50143980
Substrate/Competitorn/a
Meas. Tech.ChEMBL_1551382 (CHEMBL3762503)
Ki 22±n/a nM
Citation Carradori, SSecci, DDe Monte, CMollica, ACeruso, MAkdemir, ASobolev, APCodispoti, RDe Cosmi, FGuglielmi, PSupuran, CT A novel library of saccharin and acesulfame derivatives as potent and selective inhibitors of carbonic anhydrase IX and XII isoforms. Bioorg Med Chem24:1095-105 (2016) 
 
Carbonic anhydrase 9
Name:Carbonic anhydrase 9
Type:Enzyme
Mol. Mass.:49669.03
Organism:Homo sapiens (Human)
Description:Catalytic domain of human cloned isozyme was used in the assay
Residue:459
BDBM50143980
NameBDBM50143980
Synonyms:CHEMBL3758923
TypeSmall organic molecule
Emp. Form.C14H10BrNO3S
Mol. Mass.352.203
SMILESBrc1ccc(CN2C(=O)c3ccccc3S2(=O)=O)cc1