Reaction Details
TargetCarbonic anhydrase 9
LigandBDBM16417
Substrate/Competitorn/a
Meas. Tech.ChEMBL_1551382 (CHEMBL3762503)
Ki 223±n/a nM
Citation Carradori, SSecci, DDe Monte, CMollica, ACeruso, MAkdemir, ASobolev, APCodispoti, RDe Cosmi, FGuglielmi, PSupuran, CT A novel library of saccharin and acesulfame derivatives as potent and selective inhibitors of carbonic anhydrase IX and XII isoforms. Bioorg Med Chem24:1095-105 (2016) 
 
Carbonic anhydrase 9
Name:Carbonic anhydrase 9
Type:Enzyme
Mol. Mass.:49669.03
Organism:Homo sapiens (Human)
Description:Catalytic domain of human cloned isozyme was used in the assay
Residue:459
BDBM16417
NameBDBM16417
Synonyms:(1,3-dioxo-1,3-dihydro-2H-isoindol-2-yl)acetic acid N-Phthaloylglycine | N-Phthalylglycine
TypeSmall organic molecule
Emp. Form.C10H7NO4
Mol. Mass.205.1669
SMILESOC(=O)CN1C(=O)c2ccccc2C1=O