Reaction Details
TargetCarbonic anhydrase 12
LigandBDBM50143906
Substrate/Competitorn/a
Meas. Tech.ChEMBL_1551383 (CHEMBL3762504)
Ki 26±n/a nM
Citation Carradori, SSecci, DDe Monte, CMollica, ACeruso, MAkdemir, ASobolev, APCodispoti, RDe Cosmi, FGuglielmi, PSupuran, CT A novel library of saccharin and acesulfame derivatives as potent and selective inhibitors of carbonic anhydrase IX and XII isoforms. Bioorg Med Chem24:1095-105 (2016) 
 
Carbonic anhydrase 12
Name:Carbonic anhydrase 12
Type:Enzyme
Mol. Mass.:39456.00
Organism:Homo sapiens (Human)
Description:Catalytic domain of human cloned isozyme was used in the assay
Residue:354
BDBM50143906
NameBDBM50143906
Synonyms:CHEMBL3758327
TypeSmall organic molecule
Emp. Form.C15H13NO3S
Mol. Mass.287.334
SMILESCc1cccc(CN2C(=O)c3ccccc3S2(=O)=O)c1