Reaction Details
TargetCarbonic anhydrase 12
LigandBDBM50143985
Substrate/Competitorn/a
Meas. Tech.ChEMBL_1551383 (CHEMBL3762504)
Ki 4.5±n/a nM
Citation Carradori, SSecci, DDe Monte, CMollica, ACeruso, MAkdemir, ASobolev, APCodispoti, RDe Cosmi, FGuglielmi, PSupuran, CT A novel library of saccharin and acesulfame derivatives as potent and selective inhibitors of carbonic anhydrase IX and XII isoforms. Bioorg Med Chem24:1095-105 (2016) 
 
Carbonic anhydrase 12
Name:Carbonic anhydrase 12
Type:Enzyme
Mol. Mass.:39456.00
Organism:Homo sapiens (Human)
Description:Catalytic domain of human cloned isozyme was used in the assay
Residue:354
BDBM50143985
NameBDBM50143985
Synonyms:CHEMBL3758373
TypeSmall organic molecule
Emp. Form.C11H10ClNO4S
Mol. Mass.287.719
SMILESCC1=CC(=O)N(Cc2ccc(Cl)cc2)S(=O)(=O)O1