Reaction Details
TargetCarbonic anhydrase 12
LigandBDBM50143902
Substrate/Competitorn/a
Meas. Tech.ChEMBL_1551383 (CHEMBL3762504)
Ki 4.1±n/a nM
Citation Carradori, SSecci, DDe Monte, CMollica, ACeruso, MAkdemir, ASobolev, APCodispoti, RDe Cosmi, FGuglielmi, PSupuran, CT A novel library of saccharin and acesulfame derivatives as potent and selective inhibitors of carbonic anhydrase IX and XII isoforms. Bioorg Med Chem24:1095-105 (2016) 
 
Carbonic anhydrase 12
Name:Carbonic anhydrase 12
Type:Enzyme
Mol. Mass.:39456.00
Organism:Homo sapiens (Human)
Description:Catalytic domain of human cloned isozyme was used in the assay
Residue:354
BDBM50143902
NameBDBM50143902
Synonyms:CHEBI:74235 | CHEMBL79350
TypeSmall organic molecule
Emp. Form.C8H7NO
Mol. Mass.133.1473
SMILESO=C1NCc2ccccc12