Reaction Details
TargetCarbonic anhydrase 2
LigandBDBM50143989
Substrate/Competitorn/a
Meas. Tech.ChEMBL_1551381 (CHEMBL3762502)
Ki 1749±n/a nM
Citation Carradori, SSecci, DDe Monte, CMollica, ACeruso, MAkdemir, ASobolev, APCodispoti, RDe Cosmi, FGuglielmi, PSupuran, CT A novel library of saccharin and acesulfame derivatives as potent and selective inhibitors of carbonic anhydrase IX and XII isoforms. Bioorg Med Chem24:1095-105 (2016) 
 
Carbonic anhydrase 2
Name:Carbonic anhydrase 2
Type:Enzyme
Mol. Mass.:29250.71
Organism:Homo sapiens (Human)
Description:P00918
Residue:260
BDBM50143989
NameBDBM50143989
Synonyms:CHEMBL3759567
TypeSmall organic molecule
Emp. Form.C12H10N2O7S
Mol. Mass.326.282
SMILESCC1=CC(=O)N(CC(=O)c2ccc(cc2)[N+]([O-])=O)S(=O)(=O)O1