Reaction Details
TargetCarbonic anhydrase 1
LigandBDBM50143990
Substrate/Competitorn/a
Meas. Tech.ChEMBL_1551380 (CHEMBL3762501)
Ki 318±n/a nM
Citation Carradori, SSecci, DDe Monte, CMollica, ACeruso, MAkdemir, ASobolev, APCodispoti, RDe Cosmi, FGuglielmi, PSupuran, CT A novel library of saccharin and acesulfame derivatives as potent and selective inhibitors of carbonic anhydrase IX and XII isoforms. Bioorg Med Chem24:1095-105 (2016) 
 
Carbonic anhydrase 1
Name:Carbonic anhydrase 1
Type:Enzyme
Mol. Mass.:28873.37
Organism:Homo sapiens (Human)
Description:P00915
Residue:261
BDBM50143990
NameBDBM50143990
Synonyms:CHEMBL3759876
TypeSmall organic molecule
Emp. Form.C13H10N2O5S
Mol. Mass.306.294
SMILESCC1=CC(=O)N(CC(=O)c2ccc(cc2)C#N)S(=O)(=O)O1