Reaction Details
TargetCarbonic anhydrase 1
LigandBDBM50143904
Substrate/Competitorn/a
Meas. Tech.ChEMBL_1551380 (CHEMBL3762501)
Ki 1368±n/a nM
Citation Carradori, SSecci, DDe Monte, CMollica, ACeruso, MAkdemir, ASobolev, APCodispoti, RDe Cosmi, FGuglielmi, PSupuran, CT A novel library of saccharin and acesulfame derivatives as potent and selective inhibitors of carbonic anhydrase IX and XII isoforms. Bioorg Med Chem24:1095-105 (2016) 
 
Carbonic anhydrase 1
Name:Carbonic anhydrase 1
Type:Enzyme
Mol. Mass.:28873.37
Organism:Homo sapiens (Human)
Description:P00915
Residue:261
BDBM50143904
NameBDBM50143904
Synonyms:CHEMBL1489759
TypeSmall organic molecule
Emp. Form.C15H13NO3S
Mol. Mass.287.334
SMILESCc1ccccc1CN1C(=O)c2ccccc2S1(=O)=O