Reaction Details
TargetCarbonic anhydrase 2
LigandBDBM50143977
Substrate/Competitorn/a
Meas. Tech.ChEMBL_1551381 (CHEMBL3762502)
Ki>10000±n/a nM
Citation Carradori, SSecci, DDe Monte, CMollica, ACeruso, MAkdemir, ASobolev, APCodispoti, RDe Cosmi, FGuglielmi, PSupuran, CT A novel library of saccharin and acesulfame derivatives as potent and selective inhibitors of carbonic anhydrase IX and XII isoforms. Bioorg Med Chem24:1095-105 (2016) 
 
Carbonic anhydrase 2
Name:Carbonic anhydrase 2
Type:Enzyme
Mol. Mass.:29250.71
Organism:Homo sapiens (Human)
Description:P00918
Residue:260
BDBM50143977
NameBDBM50143977
Synonyms:CHEMBL3760060
TypeSmall organic molecule
Emp. Form.C15H10F3NO3S
Mol. Mass.341.305
SMILESFC(F)(F)c1ccc(CN2C(=O)c3ccccc3S2(=O)=O)cc1