Reaction Details
TargetCarbonic anhydrase 1
LigandBDBM50143993
Substrate/Competitorn/a
Meas. Tech.ChEMBL_1551380 (CHEMBL3762501)
Ki>10000±n/a nM
Citation Carradori, SSecci, DDe Monte, CMollica, ACeruso, MAkdemir, ASobolev, APCodispoti, RDe Cosmi, FGuglielmi, PSupuran, CT A novel library of saccharin and acesulfame derivatives as potent and selective inhibitors of carbonic anhydrase IX and XII isoforms. Bioorg Med Chem24:1095-105 (2016) 
 
Carbonic anhydrase 1
Name:Carbonic anhydrase 1
Type:Enzyme
Mol. Mass.:28873.37
Organism:Homo sapiens (Human)
Description:P00915
Residue:261
BDBM50143993
NameBDBM50143993
Synonyms:CHEMBL3758979
TypeSmall organic molecule
Emp. Form.C13H8N2O5S2
Mol. Mass.336.343
SMILES[O-][N+](=O)c1ccccc1SN1C(=O)c2ccccc2S1(=O)=O