Reaction Details
TargetCarbonic anhydrase 1
LigandBDBM10884
Substrate/Competitorn/a
Meas. Tech.ChEMBL_1552240 (CHEMBL3761242)
Ki 50000±n/a nM
Citation Del Prete, SVullo, DDe Luca, VCarginale, VFerraroni, MOsman, SMAlOthman, ZSupuran, CTCapasso, C Sulfonamide inhibition studies of the฿-carbonic anhydrase from the pathogenic bacterium Vibrio cholerae. Bioorg Med Chem24:1115-20 (2016) 
 
Carbonic anhydrase 1
Name:Carbonic anhydrase 1
Type:Enzyme
Mol. Mass.:28873.37
Organism:Homo sapiens (Human)
Description:P00915
Residue:261
BDBM10884
NameBDBM10884
Synonyms:(2S,4S)-4-(ethylamino)-2-methyl-1,1-dioxo-2H,3H,4H-1,7-thieno[2,3-b]thiopyran-6-sulfonamide Dorzolamide (DZA)
TypeSmall organic molecule
Emp. Form.C10H16N2O4S3
Mol. Mass.324.44
SMILESCCN[C@H]1C[C@H](C)S(=O)(=O)c2sc(cc12)S(N)(=O)=O