Reaction Details
TargetSerine/threonine-protein kinase pim-1
LigandBDBM50364776
Substrate/Competitorn/a
Meas. Tech.ChEMBL_1554502 (CHEMBL3767799)
IC50 48±n/a nM
Citation Fan, YBLi, KHuang, MCao, YLi, YJin, SYLiu, WBWen, JCLiu, DZhao, LX Design and synthesis of substituted pyrido[3,2-d]-1,2,3-triazines as potential Pim-1 inhibitors. Bioorg Med Chem Lett26:1224-8 (2016) 
 
Serine/threonine-protein kinase pim-1
Name:Serine/threonine-protein kinase pim-1
Type:Protein
Mol. Mass.:35681.82
Organism:Homo sapiens (Human)
Description:P11309
Residue:313
BDBM50364776
NameBDBM50364776
Synonyms:CHEMBL1952141 | CHEMBL1952329
TypeSmall organic molecule
Emp. Form.C20H22F3N5O
Mol. Mass.405.4168
SMILESCN1CCC(CNc2ccc3ncc(-c4cccc(OC(F)(F)F)c4)n3n2)CC1