Reaction Details
Target5-hydroxytryptamine receptor 2A
LigandBDBM50145587
Substrate/Competitorn/a
Meas. Tech.ChEMBL_1556023 (CHEMBL3767882)
Ki 0.793000±n/a nM
Citation Fiorino, FCiano, AMagli, ESeverino, BCorvino, APerissutti, EFrecentese, FDi Vaio, PIzzo, AACapasso, RMassarelli, PNencini, CRossi, IKedzierska, EOrzelska-Gòrka, JBielenica, ASantagada, VCaliendo, G Synthesis, in vitro and in vivo pharmacological evaluation of serotoninergic ligands containing an isonicotinic nucleus. Eur J Med Chem110:133-50 (2016) 
 
5-hydroxytryptamine receptor 2A
Name:5-hydroxytryptamine receptor 2A
Type:G Protein-Coupled Receptor (GPCR)
Mol. Mass.:52852.05
Organism:Rattus norvegicus (rat)
Description:Rat cortex membranes 5-HT2A receptors.
Residue:471
BDBM50145587
NameBDBM50145587
Synonyms:CHEMBL3764080
TypeSmall organic molecule
Emp. Form.C20H24N4O3
Mol. Mass.368.4296
SMILESO=C(NCCN1CCN(Cc2ccc3OCOc3c2)CC1)c1ccncc1