Reaction Details
TargetHexokinase-4
LigandBDBM50145879
Substrate/Competitorn/a
Meas. Tech.ChEMBL_1554117 (CHEMBL3768919)
EC50 6630±n/a nM
Citation Paczal, ABálint, BWéber, CSzabó, ZBOndi, LTheret, IDe Ceuninck, FBernard, CKtorza, APerron-Sierra, FKotschy, A Structure-Activity Relationship of Azaindole-Based Glucokinase Activators. J Med Chem59:687-706 (2016) 
 
Hexokinase-4
Name:Hexokinase-4
Type:Enzyme
Mol. Mass.:52175.81
Organism:Homo sapiens (Human)
Description:P35557
Residue:465
BDBM50145879
NameBDBM50145879
Synonyms:CHEMBL3765684
TypeSmall organic molecule
Emp. Form.C21H24ClN3OS
Mol. Mass.401.953
SMILESC[S+]([O-])c1ccc(cc1Cl)C(NC1CCCCC1)c1cc2cccnc2[nH]1