Reaction Details
TargetHexokinase-4
LigandBDBM50145885
Substrate/Competitorn/a
Meas. Tech.ChEMBL_1554117 (CHEMBL3768919)
EC50 173±n/a nM
Citation Paczal, ABálint, BWéber, CSzabó, ZBOndi, LTheret, IDe Ceuninck, FBernard, CKtorza, APerron-Sierra, FKotschy, A Structure-Activity Relationship of Azaindole-Based Glucokinase Activators. J Med Chem59:687-706 (2016) 
 
Hexokinase-4
Name:Hexokinase-4
Type:Enzyme
Mol. Mass.:52175.81
Organism:Homo sapiens (Human)
Description:P35557
Residue:465
BDBM50145885
NameBDBM50145885
Synonyms:CHEMBL3764824
TypeSmall organic molecule
Emp. Form.C22H23ClN2O2
Mol. Mass.382.883
SMILESCOC(=O)c1ccc(cc1Cl)C(CC1CCCC1)c1cc2cccnc2[nH]1