Reaction Details
TargetSigma non-opioid intracellular receptor 1
LigandBDBM50146584
Substrate/Competitorn/a
Meas. Tech.ChEMBL_1555061 (CHEMBL3767807)
Ki 3.6±n/a nM
Citation Abate, CRiganti, CPati, MLGhigo, DBerardi, FMavlyutov, TGuo, LWRuoho, A Development of sigma-1 (s1) receptor fluorescent ligands as versatile tools to studys1 receptors. Eur J Med Chem108:577-85 (2016) 
 
Sigma non-opioid intracellular receptor 1
Name:Sigma non-opioid intracellular receptor 1
Type:Protein
Mol. Mass.:25307.17
Organism:Cavia porcellus (Guinea pig)
Description:Q60492
Residue:223
BDBM50146584
NameBDBM50146584
Synonyms:CHEMBL3765740
TypeSmall organic molecule
Emp. Form.C36H51N3O3
Mol. Mass.573.8084
SMILESCC1CCN(CCCCC2CCCc3cc(OCCCCCCN4C(=O)c5ccc(cc5C4=O)N(C)C)ccc23)CC1