Reaction Details
TargetSigma non-opioid intracellular receptor 1
LigandBDBM50146586
Substrate/Competitorn/a
Meas. Tech.ChEMBL_1555061 (CHEMBL3767807)
Ki 13±n/a nM
Citation Abate, CRiganti, CPati, MLGhigo, DBerardi, FMavlyutov, TGuo, LWRuoho, A Development of sigma-1 (s1) receptor fluorescent ligands as versatile tools to studys1 receptors. Eur J Med Chem108:577-85 (2016) 
 
Sigma non-opioid intracellular receptor 1
Name:Sigma non-opioid intracellular receptor 1
Type:Protein
Mol. Mass.:25307.17
Organism:Cavia porcellus (Guinea pig)
Description:Q60492
Residue:223
BDBM50146586
NameBDBM50146586
Synonyms:CHEMBL3763740
TypeSmall organic molecule
Emp. Form.C39H54N4O4
Mol. Mass.642.8705
SMILESCN(C)c1ccc2C(=O)N(CCCCCCOc3ccc4C(CCC(=O)N5CCN(CC5)C5CCCCC5)CCCc4c3)C(=O)c2c1