Reaction Details
TargetCereblon isoform 4
LigandBDBM50026473
Substrate/Competitorn/a
Meas. Tech.ChEMBL_1555515 (CHEMBL3768097)
IC50 10000000±n/a nM
Citation Boichenko, IDeiss, SBär, KHartmann, MDHernandez Alvarez, B A FRET-Based Assay for the Identification and Characterization of Cereblon Ligands. J Med Chem59:770-4 (2016) 
 
Cereblon isoform 4
Name:Cereblon isoform 4
Synonyms:Cereblon isoform 4
Type:PROTEIN
Mol. Mass.:13620.40
Organism:Magnetospirillum gryphiswaldense
Description:ChEMBL_116733
Residue:124
BDBM50026473
NameBDBM50026473
TypeSmall organic molecule
Emp. Form.C2H6O2S
Mol. Mass.94.133
SMILESCS(C)(=O)=O