Reaction Details
TargetCereblon isoform 4
LigandBDBM7814
Substrate/Competitorn/a
Meas. Tech.ChEMBL_1555519 (CHEMBL3768101)
Ki 4300±n/a nM
Citation Boichenko, IDeiss, SBär, KHartmann, MDHernandez Alvarez, B A FRET-Based Assay for the Identification and Characterization of Cereblon Ligands. J Med Chem59:770-4 (2016) 
 
Cereblon isoform 4
Name:Cereblon isoform 4
Synonyms:Cereblon isoform 4
Type:PROTEIN
Mol. Mass.:13620.40
Organism:Magnetospirillum gryphiswaldense
Description:ChEMBL_116733
Residue:124
BDBM7814
NameBDBM7814
TypeSmall organic molecule
Emp. Form.C4H5NO2
Mol. Mass.99.088
SMILESO=C1CCC(=O)N1