Reaction Details
TargetCereblon isoform 4
LigandBDBM50070114
Substrate/Competitorn/a
Meas. Tech.ChEMBL_1555519 (CHEMBL3768101)
Ki 4400±n/a nM
Citation Boichenko, IDeiss, SBär, KHartmann, MDHernandez Alvarez, B A FRET-Based Assay for the Identification and Characterization of Cereblon Ligands. J Med Chem59:770-4 (2016) 
 
Cereblon isoform 4
Name:Cereblon isoform 4
Synonyms:Cereblon isoform 4
Type:PROTEIN
Mol. Mass.:13620.40
Organism:Magnetospirillum gryphiswaldense
Description:ChEMBL_116733
Residue:124
BDBM50070114
NameBDBM50070114
TypeSmall organic molecule
Emp. Form.C13H10N2O4
Mol. Mass.258.2295
SMILESO=C1N(C2CCC(=O)NC2=O)C(=O)c2ccccc12