Reaction Details
TargetCarbonic anhydrase 1
LigandBDBM50146828
Substrate/Competitorn/a
Meas. Tech.ChEMBL_1555756 (CHEMBL3766367)
Ki 656±n/a nM
Citation Cornelio, BLaronze-Cochard, MCeruso, MFerraroni, MRance, GACarta, FKhlobystov, ANFontana, ASupuran, CTSapi, J 4-Arylbenzenesulfonamides as Human Carbonic Anhydrase Inhibitors (hCAIs): Synthesis by Pd Nanocatalyst-Mediated Suzuki-Miyaura Reaction, Enzyme Inhibition, and X-ray Crystallographic Studies. J Med Chem59:721-32 (2016) 
 
Carbonic anhydrase 1
Name:Carbonic anhydrase 1
Type:Enzyme
Mol. Mass.:28873.37
Organism:Homo sapiens (Human)
Description:P00915
Residue:261
BDBM50146828
NameBDBM50146828
Synonyms:CHEMBL3764340
TypeSmall organic molecule
Emp. Form.C14H12N2O2S
Mol. Mass.272.322
SMILESNS(=O)(=O)c1ccc(cc1)-c1cc2ccccc2[nH]1