Reaction Details
TargetCarbonic anhydrase 2
LigandBDBM50146827
Substrate/Competitorn/a
Meas. Tech.ChEMBL_1555757 (CHEMBL3766368)
Ki 12±n/a nM
Citation Cornelio, BLaronze-Cochard, MCeruso, MFerraroni, MRance, GACarta, FKhlobystov, ANFontana, ASupuran, CTSapi, J 4-Arylbenzenesulfonamides as Human Carbonic Anhydrase Inhibitors (hCAIs): Synthesis by Pd Nanocatalyst-Mediated Suzuki-Miyaura Reaction, Enzyme Inhibition, and X-ray Crystallographic Studies. J Med Chem59:721-32 (2016) 
 
Carbonic anhydrase 2
Name:Carbonic anhydrase 2
Type:Enzyme
Mol. Mass.:29250.71
Organism:Homo sapiens (Human)
Description:P00918
Residue:260
BDBM50146827
NameBDBM50146827
Synonyms:CHEMBL3764569
TypeSmall organic molecule
Emp. Form.C20H16N2O4S2
Mol. Mass.412.482
SMILESNS(=O)(=O)c1ccc(cc1)-c1cc2ccccc2n1S(=O)(=O)c1ccccc1