Reaction Details
TargetCarbonic anhydrase 12
LigandBDBM50146824
Substrate/Competitorn/a
Meas. Tech.ChEMBL_1555759 (CHEMBL3766370)
Ki 5.2±n/a nM
Citation Cornelio, BLaronze-Cochard, MCeruso, MFerraroni, MRance, GACarta, FKhlobystov, ANFontana, ASupuran, CTSapi, J 4-Arylbenzenesulfonamides as Human Carbonic Anhydrase Inhibitors (hCAIs): Synthesis by Pd Nanocatalyst-Mediated Suzuki-Miyaura Reaction, Enzyme Inhibition, and X-ray Crystallographic Studies. J Med Chem59:721-32 (2016) 
 
Carbonic anhydrase 12
Name:Carbonic anhydrase 12
Type:Enzyme
Mol. Mass.:39456.00
Organism:Homo sapiens (Human)
Description:Catalytic domain of human cloned isozyme was used in the assay
Residue:354
BDBM50146824
NameBDBM50146824
Synonyms:CHEMBL3764921
TypeSmall organic molecule
Emp. Form.C13H11NO4S
Mol. Mass.277.296
SMILESNS(=O)(=O)c1ccc(cc1)-c1ccc2OCOc2c1