Reaction Details
TargetProstaglandin G/H synthase 2
LigandBDBM23928
Substrate/Competitorn/a
Meas. Tech.ChEBML_1554540
IC50 1667±n/a nM
Citation Aldawsari, FSAguiar, RPWiirzler, LAAguayo-Ortiz, RAljuhani, NCuman, RKMedina-Franco, JLSiraki, AGVelázquez-Martínez, CA Anti-inflammatory and antioxidant properties of a novel resveratrol-salicylate hybrid analog. Bioorg Med Chem Lett26:1411-5 (2016) 
 
Prostaglandin G/H synthase 2
Name:Prostaglandin G/H synthase 2
Type:Enzyme
Mol. Mass.:69003.89
Organism:Homo sapiens (Human)
Description:Recombinant Cox-2 provided by Cayman (Cayman Chemical Co.,Ann Arbor, MI).
Residue:604
BDBM23928
NameBDBM23928
Synonyms:1,3-dimethoxy-5-[(E)-2-(4-methoxyphenyl)ethenyl]benzene trans-Stilbene Derivative, 4a
TypeSmall organic molecule
Emp. Form.C17H18O3
Mol. Mass.270.323
SMILESCOc1ccc(\C=C\c2cc(OC)cc(OC)c2)cc1