Reaction Details
TargetCarbonic anhydrase 1
LigandBDBM50147168
Substrate/Competitorn/a
Meas. Tech.ChEMBL_1554385 (CHEMBL3767219)
Ki 7.9±n/a nM
Citation Eldehna, WMFares, MCeruso, MGhabbour, HAAbou-Seri, SMAbdel-Aziz, HAAbou El Ella, DASupuran, CT Amido/ureidosubstituted benzenesulfonamides-isatin conjugates as low nanomolar/subnanomolar inhibitors of the tumor-associated carbonic anhydrase isoform XII. Eur J Med Chem110:259-66 (2016) 
 
Carbonic anhydrase 1
Name:Carbonic anhydrase 1
Type:Enzyme
Mol. Mass.:28873.37
Organism:Homo sapiens (Human)
Description:P00915
Residue:261
BDBM50147168
NameBDBM50147168
Synonyms:CHEMBL3765057
TypeSmall organic molecule
Emp. Form.C21H15BrN4O4S
Mol. Mass.499.337
SMILESNS(=O)(=O)c1ccc(NC(=O)c2ccc(cc2)\N=C2/C(=O)Nc3ccc(Br)cc23)cc1