Reaction Details
TargetCarbonic anhydrase 1
LigandBDBM50147188
Substrate/Competitorn/a
Meas. Tech.ChEMBL_1554385 (CHEMBL3767219)
Ki 45±n/a nM
Citation Eldehna, WMFares, MCeruso, MGhabbour, HAAbou-Seri, SMAbdel-Aziz, HAAbou El Ella, DASupuran, CT Amido/ureidosubstituted benzenesulfonamides-isatin conjugates as low nanomolar/subnanomolar inhibitors of the tumor-associated carbonic anhydrase isoform XII. Eur J Med Chem110:259-66 (2016) 
 
Carbonic anhydrase 1
Name:Carbonic anhydrase 1
Type:Enzyme
Mol. Mass.:28873.37
Organism:Homo sapiens (Human)
Description:P00915
Residue:261
BDBM50147188
NameBDBM50147188
Synonyms:CHEMBL3764056
TypeSmall organic molecule
Emp. Form.C22H19N5O4S
Mol. Mass.449.482
SMILESCc1ccc2NC(=O)\C(=N/c3ccc(NC(=O)Nc4ccc(cc4)S(N)(=O)=O)cc3)c2c1