Reaction Details
TargetCarbonic anhydrase 2
LigandBDBM50147172
Substrate/Competitorn/a
Meas. Tech.ChEMBL_1554386 (CHEMBL3767220)
Ki 157±n/a nM
Citation Eldehna, WMFares, MCeruso, MGhabbour, HAAbou-Seri, SMAbdel-Aziz, HAAbou El Ella, DASupuran, CT Amido/ureidosubstituted benzenesulfonamides-isatin conjugates as low nanomolar/subnanomolar inhibitors of the tumor-associated carbonic anhydrase isoform XII. Eur J Med Chem110:259-66 (2016) 
 
Carbonic anhydrase 2
Name:Carbonic anhydrase 2
Type:Enzyme
Mol. Mass.:29250.71
Organism:Homo sapiens (Human)
Description:P00918
Residue:260
BDBM50147172
NameBDBM50147172
Synonyms:CHEMBL3589744
TypeSmall organic molecule
Emp. Form.C21H17N5O4S
Mol. Mass.435.456
SMILESNS(=O)(=O)c1ccc(NC(=O)Nc2ccc(cc2)\N=C2/C(=O)Nc3ccccc23)cc1