Reaction Details
TargetCarbonic anhydrase 9
LigandBDBM50147175
Substrate/Competitorn/a
Meas. Tech.ChEMBL_1554387 (CHEMBL3767221)
Ki 15±n/a nM
Citation Eldehna, WMFares, MCeruso, MGhabbour, HAAbou-Seri, SMAbdel-Aziz, HAAbou El Ella, DASupuran, CT Amido/ureidosubstituted benzenesulfonamides-isatin conjugates as low nanomolar/subnanomolar inhibitors of the tumor-associated carbonic anhydrase isoform XII. Eur J Med Chem110:259-66 (2016) 
 
Carbonic anhydrase 9
Name:Carbonic anhydrase 9
Type:Enzyme
Mol. Mass.:49669.03
Organism:Homo sapiens (Human)
Description:Catalytic domain of human cloned isozyme was used in the assay
Residue:459
BDBM50147175
NameBDBM50147175
Synonyms:CHEMBL3763750
TypeSmall organic molecule
Emp. Form.C21H16N6O6S
Mol. Mass.480.453
SMILESNS(=O)(=O)c1ccc(NC(=O)Nc2ccc(cc2)\N=C2/C(=O)Nc3ccc(cc23)[N+]([O-])=O)cc1