Reaction Details
TargetCarbonic anhydrase 12
LigandBDBM50147171
Substrate/Competitorn/a
Meas. Tech.ChEMBL_1554388 (CHEMBL3767222)
Ki 0.470000±n/a nM
Citation Eldehna, WMFares, MCeruso, MGhabbour, HAAbou-Seri, SMAbdel-Aziz, HAAbou El Ella, DASupuran, CT Amido/ureidosubstituted benzenesulfonamides-isatin conjugates as low nanomolar/subnanomolar inhibitors of the tumor-associated carbonic anhydrase isoform XII. Eur J Med Chem110:259-66 (2016) 
 
Carbonic anhydrase 12
Name:Carbonic anhydrase 12
Type:Enzyme
Mol. Mass.:39456.00
Organism:Homo sapiens (Human)
Description:Catalytic domain of human cloned isozyme was used in the assay
Residue:354
BDBM50147171
NameBDBM50147171
Synonyms:CHEMBL3764657
TypeSmall organic molecule
Emp. Form.C22H18N4O5S
Mol. Mass.450.467
SMILESCOc1ccc2NC(=O)\C(=N/c3ccc(cc3)C(=O)Nc3ccc(cc3)S(N)(=O)=O)c2c1