Reaction Details
TargetCarbonic anhydrase 12
LigandBDBM50095119
Substrate/Competitorn/a
Meas. Tech.ChEMBL_1554388 (CHEMBL3767222)
Ki 0.670000±n/a nM
Citation Eldehna, WMFares, MCeruso, MGhabbour, HAAbou-Seri, SMAbdel-Aziz, HAAbou El Ella, DASupuran, CT Amido/ureidosubstituted benzenesulfonamides-isatin conjugates as low nanomolar/subnanomolar inhibitors of the tumor-associated carbonic anhydrase isoform XII. Eur J Med Chem110:259-66 (2016) 
 
Carbonic anhydrase 12
Name:Carbonic anhydrase 12
Type:Enzyme
Mol. Mass.:39456.00
Organism:Homo sapiens (Human)
Description:Catalytic domain of human cloned isozyme was used in the assay
Residue:354
BDBM50095119
NameBDBM50095119
Synonyms:CHEMBL3589200
TypeSmall organic molecule
Emp. Form.C21H16ClN5O4S
Mol. Mass.469.901
SMILESNS(=O)(=O)c1ccc(NC(=O)Nc2ccc(cc2)\N=C2/C(=O)Nc3ccc(Cl)cc23)cc1