Reaction Details
TargetCarbonic anhydrase 2
LigandBDBM50147765
Substrate/Competitorn/a
Meas. Tech.ChEMBL_1555888 (CHEMBL3767105)
Ki 5.8±n/a nM
Citation Alafeefy, AMCarta, FCeruso, MAl-Tamimi, AMAl-Kahtani, AASupuran, CT Development of 3-(4-aminosulphonyl)-phenyl-2-mercapto-3H-quinazolin-4-ones as inhibitors of carbonic anhydrase isoforms involved in tumorigenesis and glaucoma. Bioorg Med Chem24:1402-7 (2016) 
 
Carbonic anhydrase 2
Name:Carbonic anhydrase 2
Type:Enzyme
Mol. Mass.:29250.71
Organism:Homo sapiens (Human)
Description:P00918
Residue:260
BDBM50147765
NameBDBM50147765
Synonyms:CHEMBL3765244
TypeSmall organic molecule
Emp. Form.C14H10BrN3O3S2
Mol. Mass.412.282
SMILESNS(=O)(=O)c1ccc(cc1)-n1c(S)nc2c(Br)cccc2c1=O