Reaction Details
TargetHistone deacetylase 1
LigandBDBM50148628
Substrate/Competitorn/a
Meas. Tech.ChEMBL_1556911 (CHEMBL3771936)
IC50>30000±n/a nM
Citation Reddy, DNBallante, FChuang, TPirolli, AMarrocco, BMarshall, GR Design and Synthesis of Simplified Largazole Analogues as Isoform-Selective Human Lysine Deacetylase Inhibitors. J Med Chem59:1613-33 (2016) 
 
Histone deacetylase 1
Name:Histone deacetylase 1
Type:Enzyme
Mol. Mass.:55090.27
Organism:Homo sapiens (Human)
Description:Q13547
Residue:482
BDBM50148628
NameBDBM50148628
Synonyms:CHEMBL3769629
TypeSmall organic molecule
Emp. Form.C23H36N6O7
Mol. Mass.508.5679
SMILES[H][C@]12CCCN1C(=O)[C@]1([H])CCCN1C(=O)C[C@@H](NC(=O)[C@@H](NC2=O)C(C)C)C(=O)NCCCC(=O)NO