Reaction Details
TargetHistone deacetylase 6
LigandBDBM50322422
Substrate/Competitorn/a
Meas. Tech.ChEMBL_1556918 (CHEMBL3771943)
IC50 9290±n/a nM
Citation Reddy, DNBallante, FChuang, TPirolli, AMarrocco, BMarshall, GR Design and Synthesis of Simplified Largazole Analogues as Isoform-Selective Human Lysine Deacetylase Inhibitors. J Med Chem59:1613-33 (2016) 
 
Histone deacetylase 6
Name:Histone deacetylase 6
Type:Chromatin regulator; hydrolase; repressor
Mol. Mass.:131381.51
Organism:Homo sapiens (Human)
Description:Q9UBN7
Residue:1215
BDBM50322422
NameBDBM50322422
Synonyms:CHEMBL1173445 | Largazole
TypeSmall organic molecule
Emp. Form.C29H42N4O5S3
Mol. Mass.622.863
SMILESCCCCCCCC(=O)SCC\C=C\[C@@H]1CC(=O)NCc2nc(cs2)C2=N[C@@](C)(CS2)C(=O)N[C@@H](C(C)C)C(=O)O1