Reaction Details
Target5-hydroxytryptamine receptor 2B
LigandBDBM50148831
Substrate/Competitorn/a
Meas. Tech.ChEMBL_1557237 (CHEMBL3773612)
Ki 6.2±n/a nM
Citation Zhou, YMa, JLin, XHuang, XPWu, KHuang, N Structure-Based Discovery of Novel and Selective 5-Hydroxytryptamine 2B Receptor Antagonists for the Treatment of Irritable Bowel Syndrome. J Med Chem59:707-20 (2016) 
 
5-hydroxytryptamine receptor 2B
Name:5-hydroxytryptamine receptor 2B
Type:G Protein-Coupled Receptor (GPCR)
Mol. Mass.:54312.47
Organism:Homo sapiens (Human)
Description:Receptor binding assays were performed using human clone stably expressed in CHO cells.
Residue:481
BDBM50148831
NameBDBM50148831
Synonyms:CHEMBL3770342
TypeSmall organic molecule
Emp. Form.C14H18BrN5
Mol. Mass.336.23
SMILESNC1=NC2(CCCCC2)NC(Nc2cccc(Br)c2)=N1