Reaction Details
Target5-hydroxytryptamine receptor 2B
LigandBDBM50148841
Substrate/Competitorn/a
Meas. Tech.ChEMBL_1557255 (CHEMBL3773630)
EC50 2520±n/a nM
Citation Cheng, JGiguere, PMSchmerberg, CMPogorelov, VMRodriguiz, RMHuang, XPZhu, HMcCorvy, JDWetsel, WCRoth, BLKozikowski, AP Further Advances in Optimizing (2-Phenylcyclopropyl)methylamines as Novel Serotonin 2C Agonists: Effects on Hyperlocomotion, Prepulse Inhibition, and Cognition Models. J Med Chem59:578-91 (2016) 
 
5-hydroxytryptamine receptor 2B
Name:5-hydroxytryptamine receptor 2B
Type:G Protein-Coupled Receptor (GPCR)
Mol. Mass.:54312.47
Organism:Homo sapiens (Human)
Description:Receptor binding assays were performed using human clone stably expressed in CHO cells.
Residue:481
BDBM50148841
NameBDBM50148841
Synonyms:CHEMBL3769421
TypeSmall organic molecule
Emp. Form.C12H15Cl2F2NO
Mol. Mass.298.156
SMILESCl.NCC1CC1c1cc(Cl)c(F)cc1OCCF