Reaction Details
Target5-hydroxytryptamine receptor 2A
LigandBDBM50148852
Substrate/Competitorn/a
Meas. Tech.ChEMBL_1557257 (CHEMBL3773632)
EC50 831±n/a nM
Citation Cheng, JGiguere, PMSchmerberg, CMPogorelov, VMRodriguiz, RMHuang, XPZhu, HMcCorvy, JDWetsel, WCRoth, BLKozikowski, AP Further Advances in Optimizing (2-Phenylcyclopropyl)methylamines as Novel Serotonin 2C Agonists: Effects on Hyperlocomotion, Prepulse Inhibition, and Cognition Models. J Med Chem59:578-91 (2016) 
 
5-hydroxytryptamine receptor 2A
Name:5-hydroxytryptamine receptor 2A
Type:undefined
Mol. Mass.:52607.65
Organism:Homo sapiens (Human)
Description:P28223
Residue:471
BDBM50148852
NameBDBM50148852
Synonyms:CHEMBL3769968
TypeSmall organic molecule
Emp. Form.C13H16ClF2NO
Mol. Mass.275.722
SMILESCl.NCC1CC1c1cc(F)c(F)cc1OCC=C