Reaction Details
Target5-hydroxytryptamine receptor 2B
LigandBDBM50161646
Substrate/Competitorn/a
Meas. Tech.ChEMBL_1557255 (CHEMBL3773630)
EC50 328±n/a nM
Citation Cheng, JGiguere, PMSchmerberg, CMPogorelov, VMRodriguiz, RMHuang, XPZhu, HMcCorvy, JDWetsel, WCRoth, BLKozikowski, AP Further Advances in Optimizing (2-Phenylcyclopropyl)methylamines as Novel Serotonin 2C Agonists: Effects on Hyperlocomotion, Prepulse Inhibition, and Cognition Models. J Med Chem59:578-91 (2016) 
 
5-hydroxytryptamine receptor 2B
Name:5-hydroxytryptamine receptor 2B
Type:G Protein-Coupled Receptor (GPCR)
Mol. Mass.:54312.47
Organism:Homo sapiens (Human)
Description:Receptor binding assays were performed using human clone stably expressed in CHO cells.
Residue:481
BDBM50161646
NameBDBM50161646
Synonyms:(1R)-8-chloro-2,3,4,5-tetrahydro-1-methyl-1H-3-benzazepine CHEMBL360328 | LORCASERIN
TypeSmall organic molecule
Emp. Form.C11H14ClN
Mol. Mass.195.689
SMILESC[C@H]1CNCCc2ccc(Cl)cc12