Reaction Details
TargetMu-type opioid receptor
LigandBDBM50148912
Substrate/Competitorn/a
Meas. Tech.ChEMBL_1557466 (CHEMBL3771797)
Ki 440±n/a nM
Citation Bender, AMGriggs, NWGao, CTrask, TJTraynor, JRMosberg, HI Rapid Synthesis of Boc-2',6'-dimethyl-l-tyrosine and Derivatives and Incorporation into Opioid Peptidomimetics. ACS Med Chem Lett6:1199-203 (2015) 
 
Mu-type opioid receptor
Name:Mu-type opioid receptor
Type:G Protein-Coupled Receptor (GPCR)
Mol. Mass.:44503.11
Organism:Rattus norvegicus (rat)
Description:Competition binding assays were carried out using membrane preparations from transfected HN9.10 cells that constitutively expressed the mu opioid receptor.
Residue:398
BDBM50148912
NameBDBM50148912
Synonyms:CHEMBL3770284
TypeSmall organic molecule
Emp. Form.C29H29N3O2
Mol. Mass.451.5595
SMILESN[C@@H](Cc1ccc2cccc(O)c2c1)C(=O)N[C@@H]1CCNc2ccc(Cc3ccccc3)cc12